{"text_format":"1","workbook":"xlsx","n_sheets":8,"sheets":["Instructions","Group 1","Base Calc","Lowrise Indoor Water Use","Lowrise Wastewater Use","Summary D+C","Summary O+M","Summary ND"],"not_rendered":{"charts":0,"images":1,"macros":1,"external_links":0,"defined_names":25,"comments":3,"pivot_tables":0},"unopened":[],"bounds":{"document_bytes":16777216,"sheet_cells":100000,"rows_first":2000,"rows_last":500,"rows_between":2000,"halvings":0,"cell_chars":16384,"cell_head_chars":4096},"cells_cut":0,"cells_raw":0,"read":"whole","date_system":"1900"}

{"sheet":"Instructions","index":0,"n_rows":63,"n_cols":22,"rows_kept":63,"cut":false,"hidden":false,"merged":[[5,4,5,10],[2,4,2,10],[10,4,10,10],[6,4,6,10],[37,4,37,10],[32,4,32,10],[30,4,30,10],[9,4,9,9],[17,4,17,10],[22,4,22,10],[25,4,25,10],[26,4,26,10],[27,4,27,10],[19,4,19,10],[18,4,18,10],[13,4,13,9],[14,4,14,10],[48,2,48,5],[49,2,49,5],[50,2,50,5],[51,2,51,5],[36,4,36,10],[52,2,52,5],[47,2,47,5],[42,12,42,16],[42,6,42,9],[43,6,43,7],[43,8,43,9],[42,10,43,10],[42,2,43,5],[44,2,44,5],[45,2,45,5],[46,2,46,5]]}
[]
[]
[null,null,null,null,"Indoor Water Use Reduction Calculator\nLEED v4 and v4.1 for D+C and v4 for O+M - WE Prerequisite/Credit Indoor Water Use Reduction \nLEED v4 for ND - GIB Prerequisite/Credit Indoor Water Use Reduction and GIB Credit Wastewater Management"]
[]
[null,null,null,null,"Step 1. "]
[null,null,null,null,"Enable macros."]
[null,null,null,null,"Note: This calculator is for use with Excel for Mac 2011 and Excel 2007 or later.  If you are experiencing a problem with this calculator, please refer to the help center instructions below."]
[null,null,null,null,"Help Center Instructions"]
[null,null,null,null,"Step 2. "]
[null,null,null,null,"Unit of measurement",null,null,null,null,null,"IP units"]
[null,null,null,null,"Note: This selection must match the unit of measurement chosen during project registration."]
[]
[null,null,null,null,"Step 3. "]
[null,null,null,null,"The project is LEED for Neighborhood Development",null,null,null,null,null,"No"]
[null,null,null,null,"Note: This selection must match the rating system chosen during project registration."]
[]
[null,null,null,null,"Step 4. "]
[null,null,null,null,"For projects pursuing GIB Prerequisite/Credit Indoor Water Use Reduction"]
[null,null,null,null,"Nonresidential, mixed-use, and multifamily residential buildings four stories or more\nComplete the Flush and/or Flow tables on the Group tab(s) for all new/major renovations nonresidential, mixed-use, and multifamily residential buildings four stories or more."]
[null,null,null,null,"Note: If actual occupancy is not known, use the default (residents = number of bedrooms + 1) for each dwelling unit.  All residential units can be included in one group."]
{"$rows_left_out":44}
{"sheet":"Group 1","index":1,"n_rows":50,"n_cols":33,"rows_kept":50,"cut":false,"hidden":false,"merged":[[32,3,32,5],[4,1,4,2],[6,1,6,9],[7,1,7,10],[8,1,8,10],[9,1,9,2],[14,1,14,10],[27,1,27,9],[28,8,29,8],[29,3,29,5],[30,3,30,5],[31,3,31,5],[44,2,44,3],[45,2,45,3],[46,2,46,3],[47,2,47,3],[33,3,33,5],[34,3,34,5],[40,1,40,10],[41,8,42,8],[42,2,42,3],[43,2,43,3]]}
[]
[null,{"$f":"REPLACE(CELL(\"filename\",A1),1,FIND(\"]\",CELL(\"filename\",A1)),\"\")","v":"Group 1"}]
[]
[]
[null,"Group name",null,"Group 1"]
[null,"Table: Project Information"]
[null,"Enter project occupancy information.  This information should be consistent with occupancy numbers used in other LEED credits. "]
[null,"Non-default gender mix\nThe default gender mix is half male and half female.  If necessary, modify the Male and Female occupant type columns for non-default gender mix if the project is specifically designed for an alternative gender ratio or the project is expected to have alternative gender usage rates for the life of the building.",null,null,null,null,null,null,null,null,null,null,null,null,null,null,null,null,null,null,null,null,null,null,"Non-default gender mix",false]
[null,"The project includes ADA and/or gender-neutral bathrooms          \nIf the project includes separate gender neutral and/or ADA restrooms without urinals, the LEED default assumption is that 5% of male occupants and 5% of female occupants use these restrooms. Enter 95% into the percent of males expected to use restrooms with urinals below. Alternately, the project team can estimate this percentage based on the project's restroom layout/anticipated usage patterns or weighted fixture counts.",null,null,null,null,null,null,null,null,null,null,null,null,null,null,null,null,null,null,null,null,null,null,"Non-default gender mix",true]
[null,"Occupancy Type",null,"Employees\n (FTE)","Visitors","Retail Customers","Students\n(K-12)","Residential","Other (specify)",null,"Gender \nRatio\n(%)",null,null,null,null,null,null,null,null,null,null,null,null,null,null,null,null,"Nondefault values"]
[null,"Total",null,null,null,null,null,null,null,null,{"$f":"SUM(K12:K13)","v":0},null,null,null,null,null,null,null,null,null,null,null,null,"Baseline","Flow",{"$f":"I49","v":0},null,{"$f":"AB12+AB13","v":0},0,0,0,0,0]
[null,"Male",null,{"$f":"IF(ISODD(D$11)=TRUE,INT(D$11/2)+1,D$11/2)","v":0},0,0,0,0,0,null,{"$f":"IFERROR(SUM($D$12:$I$12) / SUM(Total2),0)","v":0},null,null,null,null,null,null,null,null,null,null,null,null,"Baseline","Flush",{"$f":"I36","v":0}]
[null,"Female",null,{"$f":"INT(D$11/2)","v":0},0,0,0,0,0,null,{"$f":"IFERROR(SUM($D$13:$I$13)/SUM(Total2),0)","v":0},null,null,null,null,null,null,null,null,null,null,null,null,"Design","Flow",{"$f":"I50","v":0}]
[null,null,null,null,null,null,null,null,null,null,null,null,null,null,null,null,null,null,null,null,null,null,null,"Design","Flush",{"$f":"I37","v":0},null,"Default values"]
[null,"Determine the percent of males expected to use urinals (enter 100% if all male restrooms have urinals, 0% if the project contains no urinals, etc)"]
[null,"Percent of males expected to use restrooms with urinals ",null,null,null,null,null,null,1,null,null,null,null,null,null,null,null,null,null,null,null,null,null,null,null,null,null,{"$f":"IF(ISODD(AB$11)=TRUE,INT(AB$11/2)+1,AB$11/2)","v":0},0,0,0,0,0]
[null,null,null,null,null,null,null,null,null,null,null,null,null,null,null,null,null,null,null,null,null,null,null,null,null,null,null,{"$f":"INT(AB$11/2)","v":0},0,0,0,0,0]
[null,"Enter the number of days the project is accessible to employees or FTE."]
[null,"Annual days of operation ",null,null,null,null,null,null,365]
[null,{"$f":"IF(I19>365,\"Annual days of operation must be between 1 and 365.\",\"\")","v":""}]
{"$rows_left_out":31}
{"sheet":"Base Calc","index":2,"n_rows":50,"n_cols":33,"rows_kept":50,"cut":false,"hidden":true,"merged":[[47,2,47,3],[29,3,29,5],[30,3,30,5],[31,3,31,5],[32,3,32,5],[33,3,33,5],[34,3,34,5],[40,1,40,10],[42,2,42,3],[43,2,43,3],[44,2,44,3],[45,2,45,3],[46,2,46,3],[41,8,42,8],[28,8,29,8],[8,1,8,10],[14,1,14,10],[27,1,27,9],[6,1,6,9],[4,1,4,2],[9,1,9,2],[7,1,7,10]]}
[]
[null,{"$f":"REPLACE(CELL(\"filename\",A1),1,FIND(\"]\",CELL(\"filename\",A1)),\"\")","v":"Base Calc"}]
[]
[]
[null,"Group name",null,{"$f":"B2","v":"Base Calc"}]
[null,"Table: Project Information"]
[null,"Enter project occupancy information.  This information should be consistent with occupancy numbers used in other LEED credits. "]
[null,"Non-default gender mix\nThe default gender mix is half male and half female.  If necessary, modify the Male and Female occupant type columns for non-default gender mix if the project is specifically designed for an alternative gender ratio or the project is expected to have alternative gender usage rates for the life of the building.",null,null,null,null,null,null,null,null,null,null,null,null,null,null,null,null,null,null,null,null,null,null,"Non-default gender mix",false]
[null,"The project includes ADA and/or gender-neutral bathrooms          \nIf the project includes separate gender neutral and/or ADA restrooms without urinals, the LEED default assumption is that 5% of male occupants and 5% of female occupants use these restrooms. Enter 95% into the percent of males expected to use restrooms with urinals below. Alternately, the project team can estimate this percentage based on the project's restroom layout/anticipated usage patterns or weighted fixture counts.",null,null,null,null,null,null,null,null,null,null,null,null,null,null,null,null,null,null,null,null,null,null,"Non-default gender mix",true]
[null,"Occupancy Type",null,"Employees\n (FTE)","Visitors","Retail Customers","Students\n(K-12)","Residential","Other (specify)",null,"Gender \nRatio\n(%)",null,null,null,null,null,null,null,null,null,null,null,null,null,null,null,null,"Nondefault values"]
[null,"Total",null,null,null,null,null,null,null,null,{"$f":"SUM(K12:K13)","v":0},null,null,null,null,null,null,null,null,null,null,null,null,"Baseline","Flow",{"$f":"I49","v":0},null,{"$f":"AB12+AB13","v":0},0,0,0,0,0]
[null,"Male",null,{"$f":"IF(ISODD(D$11)=TRUE,INT(D$11/2)+1,D$11/2)","v":0},0,0,0,0,0,null,{"$f":"IFERROR(SUM($D$12:$I$12) / SUM(Total2),0)","v":0},null,null,null,null,null,null,null,null,null,null,null,null,"Baseline","Flush",{"$f":"I36","v":0}]
[null,"Female",null,{"$f":"INT(D$11/2)","v":0},0,0,0,0,0,null,{"$f":"IFERROR(SUM($D$13:$I$13)/SUM(Total2),0)","v":0},null,null,null,null,null,null,null,null,null,null,null,null,"Design","Flow",{"$f":"I50","v":0}]
[null,null,null,null,null,null,null,null,null,null,null,null,null,null,null,null,null,null,null,null,null,null,null,"Design","Flush",{"$f":"I37","v":0},null,"Default values"]
[null,"Determine the percent of males expected to use urinals (enter 100% if all male restrooms have urinals, 0% if the project contains no urinals, etc)"]
[null,"Percent of males expected to use restrooms with urinals ",null,null,null,null,null,null,1,null,null,null,null,null,null,null,null,null,null,null,null,null,null,null,null,null,null,{"$f":"IF(ISODD(AB$11)=TRUE,INT(AB$11/2)+1,AB$11/2)","v":0},0,0,0,0,0]
[null,null,null,null,null,null,null,null,null,null,null,null,null,null,null,null,null,null,null,null,null,null,null,null,null,null,null,{"$f":"INT(AB$11/2)","v":0},0,0,0,0,0]
[null,"Enter the number of days the project is accessible to employees or FTE."]
[null,"Annual days of operation ",null,null,null,null,null,null,365]
[null,{"$f":"IF(I19>365,\"Annual days of operation must be between 1 and 365.\",\"\")","v":""}]
{"$rows_left_out":31}
{"sheet":"Lowrise Indoor Water Use","index":3,"n_rows":16,"n_cols":14,"rows_kept":16,"cut":false,"hidden":true,"merged":[[6,13,7,13],[13,1,13,12],[14,1,14,12],[15,1,15,12],[6,1,7,1],[6,2,6,4],[6,5,6,7],[6,8,6,10],[6,11,6,12]]}
[]
[null,{"$f":"REPLACE(CELL(\"filename\",A1),1,FIND(\"]\",CELL(\"filename\",A1)),\"\")","v":"Lowrise Indoor Water Use"}]
[null,"For ND projects with new single-family residential and multiunit residential buildings three stories or fewer"]
[]
[]
[null,"Complete the table for all new single-family residential and new multiunit residential buildings three stories or fewer."]
[null,"Building ID","Lavatory Faucet",null,null,"Showerheads",null,null,"Toilets",null,null,"Clothes Washers",null,"Total \nWE Credit Indoor Water Use\nPoints"]
[null,null,"WaterSense \nor equivalent\nlabeled",{"$f":"CONCATENATE(\"Average rated flow volume\n\",IF(UOM=1,\" (gpm)\",\" (lpm)\"))","v":"Average rated flow volume\n (gpm)"},"Points","WaterSense \nor equivalent\nlabeled",{"$f":"CONCATENATE(\"Average rated flow volume\n\",IF(UOM=1,\" (gpm)\",\" (lpm)\"))","v":"Average rated flow volume\n (gpm)"},"Points","WaterSense \nor equivalent\nlabeled",{"$f":"CONCATENATE(\"Average rated flush volume\n\",IF(UOM=1,\" (gpf)\",\" (lpf)\"))","v":"Average rated flush volume\n (gpf)"},"Points","ENERGY \nSTAR qualified or equivalent","Points"]
[{"$f":"IF(B9>0,0,0)","v":0},null,null,null,{"$f":"IF(C9=\"Yes\",IF(UOM=2,IF(AND(D9>0,D9<=3.7),2,IF(AND(D9>0,D9<=5.6),1,0)),IF(AND(D9>0,D9<=1),2,IF(AND(D9>0,D9<=1.5),1,0))),0)","v":0},null,null,{"$f":"IF(F9=\"Yes\",IF(UOM=2,IF(AND(G9>0,G9<=5.6),2,IF(AND(G9>0,G9<=6.6),1,0)),IF(AND(G9>0,G9<=1.5),2,IF(AND(G9>0,G9<=1.75),1,0))),0)","v":0},null,null,{"$f":"IF(I9=\"Yes\",IF(UOM=2,IF(AND(J9>0,J9<=4.1),1,0),IF(AND(J9>0,J9<=1.1),1,0)),0)","v":0},null,{"$f":"IF(L9=\"Yes\",1,0)","v":0},{"$f":"SUM(E9,H9,K9,M9)","v":0}]
[{"$f":"IF(B10>0,0,0)","v":0},null,null,null,0,null,null,0,null,null,0,null,{"$f":"IF(L10=\"Yes\",1,0)","v":0},{"$f":"SUM(E10,H10,K10,M10)","v":0}]
[0,null,null,null,0,null,null,0,null,null,0,null,0,0]
[null,null,null,null,0,null,null,0,null,null,0,null,0,0]
[null,null,null,null,0,null,null,0,null,null,0,null,0,0]
["A","Total number of new single-family residential buildings and new multiunit residential buildings three stories or fewer",null,null,null,null,null,null,null,null,null,null,null,{"$f":"COUNTA(B9:B13)","v":0}]
[null,"Total number of residential buildings that would earn at least 2 points under LEED v4 for Homes WE Credit Indoor Water Use",null,null,null,null,null,null,null,null,null,null,null,{"$f":"COUNTIF(N9:N13,\">=2\")","v":0}]
[null,"For project pursuing GIB Credit Indoor Water Use: Total number of residential buildings that would earn at least 4 points under LEED v4 for Homes WE Credit Indoor Water Use",null,null,null,null,null,null,null,null,null,null,null,{"$f":"COUNTIF(N9:N13,\">=4\")","v":0}]

{"sheet":"Lowrise Wastewater Use","index":4,"n_rows":138,"n_cols":23,"rows_kept":138,"cut":false,"hidden":true,"merged":[[20,1,20,3],[22,1,22,2],[29,1,29,4],[30,1,30,4],[30,15,30,17],[30,18,30,19],[5,1,5,8],[8,1,8,3],[31,17,32,17],[31,18,32,18],[31,19,32,19],[31,21,32,21],[48,1,48,4],[48,5,48,14],[48,15,48,17],[48,18,48,19],[31,9,31,10],[31,11,31,12],[31,13,32,13],[31,14,32,14],[31,15,32,15],[31,16,32,16],[31,1,32,1],[31,2,32,2],[31,3,32,3],[31,4,32,4],[31,5,31,6],[31,7,31,8],[49,17,50,17],[49,18,50,18],[49,19,50,19],[49,21,50,21],[61,1,61,4],[72,1,72,4],[72,15,72,17],[72,18,72,19],[49,9,49,10],[49,11,49,12],[49,13,50,13],[49,14,50,14],[49,15,50,15],[49,16,50,16],[49,1,50,1],[49,2,50,2],[49,3,50,3],[49,4,50,4],[49,5,49,6],[49,7,49,8],[73,17,74,17],[73,18,74,18],[73,19,74,19],[73,21,74,21],[84,1,84,2],[91,1,91,4],[91,15,91,17],[91,18,91,19],[73,9,73,10],[73,11,73,12],[73,13,74,13],[73,14,74,14],[73,15,74,15],[73,16,74,16],[73,1,74,1],[73,2,74,2],[73,3,74,3],[73,4,74,4],[73,5,73,6],[73,7,73,8],[92,17,93,17],[92,18,93,18],[92,19,93,19],[92,21,93,21],[103,1,103,2],[110,1,110,4],[110,15,110,17],[110,18,110,19],[92,9,92,10],[92,11,92,12],[92,13,93,13],[92,14,93,14],[92,15,93,15],[92,16,93,16],[92,1,93,1],[92,2,93,2],[92,3,93,3],[92,4,93,4],[92,5,92,6],[92,7,92,8],[111,17,112,17],[111,18,112,18],[111,19,112,19],[111,21,112,21],[122,1,122,5],[123,1,123,5],[111,9,111,10],[111,11,111,12],[111,13,112,13],[111,14,112,14],[111,15,112,15],[111,16,112,16],[111,1,112,1],[111,2,112,2],[111,3,112,3],[111,4,112,4],[111,5,111,6],[111,7,111,8],[131,9,131,10],[132,5,132,6],[132,7,132,8],[131,1,132,1],[131,2,132,4],[131,5,131,8],[124,1,124,5],[125,1,125,5],[126,1,126,5],[127,1,127,5]]}
[]
[null,"Lowrise Wastewater Use"]
[null,"For ND projects with new single-family residential and multiunit residential buildings three stories or fewer and pursuing GIB Credit Wastewater Management"]
[]
[]
[null,"Complete the tables below for all single-family residential and multiunit residential buildings three stories or more."]
[]
[null,"Unit Information"]
[null,"List the number of each type of unit for the building. This information is used to double check your entries for each fixture type.  For new single family homes, put  '1' by the number of bedrooms."]
[null,"Unit Type","Number of \nUnits","Occupants",null,null,null,null,null,null,null,null,null,null,null,null,null,null,null,null,null,"Number of Bedrooms","All units"]
[{"$f":"IF(B11>0,0,0)","v":0},"Efficiency",null,{"$f":"(1+1)*C11","v":0},null,null,null,null,null,null,null,null,null,null,null,null,null,null,null,null,null,1,"Efficiency"]
[{"$f":"IF(B12>0,0,0)","v":0},"1 Bedroom",null,{"$f":"(1+1)*C12","v":0},null,null,null,null,null,null,null,null,null,null,null,null,null,null,null,null,null,1,"1 Bedroom"]
[{"$f":"IF(B13>0,0,0)","v":0},"2 Bedrooms",null,{"$f":"(2+1)*C13","v":0},null,null,null,null,null,null,null,null,null,null,null,null,null,null,null,null,null,2,"2 Bedrooms"]
[{"$f":"IF(B14>0,0,0)","v":0},"3 Bedrooms",null,{"$f":"(3+1)*C14","v":0},null,null,null,null,null,null,null,null,null,null,null,null,null,null,null,null,null,3,"3 Bedrooms"]
[0,"4 Bedrooms",null,{"$f":"(4+1)*C15","v":0},null,null,null,null,null,null,null,null,null,null,null,null,null,null,null,null,null,4,"4 Bedrooms"]
[null,"5 Bedrooms",null,{"$f":"(5+1)*C16","v":0},null,null,null,null,null,null,null,null,null,null,null,null,null,null,null,null,null,5,"5 Bedrooms"]
[null,"6 Bedrooms",null,{"$f":"(6+1)*C17","v":0},null,null,null,null,null,null,null,null,null,null,null,null,null,null,null,null,null,6,"6 Bedrooms"]
[null,"Totals",{"$f":"SUM(C11:C17)","v":0},{"$f":"SUM(D11:D17)","v":0}]
["A"]
[null,"Indoor Water Use"]
{"$rows_left_out":119}
{"sheet":"Summary D+C","index":5,"n_rows":20,"n_cols":10,"rows_kept":20,"cut":false,"hidden":false,"merged":[[7,4,7,6],[8,4,8,6],[7,3,9,3],[8,7,8,9],[7,7,7,9]]}
[]
[null,null,1]
[null,null,1,"Summary for Design and Construction Rating Systems"]
[null,null,1,"Note: All information on this tab is READ-ONLY. To edit, see the previous tab(s). "]
[null,null,1]
[null,null,1]
[null,null,1]
[null,null,1,"Group Name","Baseline Case",null,null,"Design Case"]
[null,null,null,null,{"$f":"IF(Instructions!T57=1,\"(gallons/year)\",\"(liters/year)\")","v":"(gallons/year)"},null,null,{"$f":"IF(Instructions!T57=1,\"(gallons/year)\",\"(liters/year)\")","v":"(gallons/year)"}]
[null,null,1,null,"Annual \nFlush \nVolume","Annual \nFlow \nVolume","Annual\nConsumption","Annual \nFlush \nVolume","Annual \nFlow \nVolume","Annual \nConsumption"]
[null,null,{"$f":"IF(OR(D11=\"Instructions\",D11=\"Base Calc\",D11=\"Lowrise Indoor Water Use\",D11=\"Lowrise Wastewater Use\",D11=\"Summary D+C\",D11=\"Summary O+M\",D11=\"Summary ND\",D11=\"\",D11=0),0,1)","v":1},{"$f":"IFERROR(INDEX(MID(Sheets,FIND(\"]\",Sheets)+1,255),ROW(A2),1),\"\")","v":"Group 1"},{"$f":"INDIRECT(\"'\"&D11&\"'!$Z$12\")","v":0},{"$f":"INDIRECT(\"'\"&$D11&\"'!$Z$11\")","v":0},{"$f":"E11+F11","v":0},{"$f":"INDIRECT(\"'\"&$D11&\"'!$Z$14\")","v":0},{"$f":"INDIRECT(\"'\"&$D11&\"'!$Z$13\")","v":0},{"$f":"H11+I11","v":0}]
[null,null,1]
[null,"A",1,{"$f":"IF(Instructions!T57=1,\"Annual baseline water consumption (gallons/year)\",\"Annual baseline water consumption (liters/year)\")","v":"Annual baseline water consumption (gallons/year)"},null,null,null,null,null,{"$f":"SUM(G11:G12)","v":0}]
[null,null,1,{"$f":"IF(Instructions!T57=1,\"Annual design water consumption (gallons/year)\",\"Annual design water consumption (liters/year)\")","v":"Annual design water consumption (gallons/year)"},null,null,null,null,null,{"$f":"SUM(J11:J12)","v":0}]
[null,null,1,"Percent water use reduction (%)",null,null,null,null,null,{"$f":"IF(J14=0,0,(J13-J14)/J13)","v":0}]
[null,null,1]
[]
[]
[]
[null,null,null,null,null,{"$f":"IFERROR(INDEX(MID(Sheets,FIND(\"]\",Sheets)+1,255),ROW(#REF!),1),\"\")","v":""}]
{"$rows_left_out":1}
{"sheet":"Summary O+M","index":6,"n_rows":28,"n_cols":10,"rows_kept":28,"cut":false,"hidden":false,"merged":[[13,3,15,3],[13,4,13,6],[13,7,13,9],[14,4,14,6],[14,7,14,9]]}
[]
[null,null,1]
[null,null,1,"Summary for Operations and Maintenance Rating Systems"]
[null,null,1,"Note: Baseline and design volumes are READ-ONLY. To edit, see the previous tab(s). "]
[null,null,1]
[null,null,1]
[null,null,1,"Unrenovated percentage of fixtures installed before 1995 (%)"]
[null,null,1]
[null,null,1,"Renovated percentage of fixtures installed in 1995 or later (%)"]
[null,null,1]
[null,null,1]
[null,null,1]
[null,null,1]
[null,null,1,"Group Name","Baseline Case",null,null,"Design Case"]
[null,null,null,null,{"$f":"IF(Instructions!T57=1,\"(gallons/year)\",\"(liters/year)\")","v":"(gallons/year)"},null,null,{"$f":"IF(Instructions!T57=1,\"(gallons/year)\",\"(liters/year)\")","v":"(gallons/year)"}]
[null,null,1,null,"Annual \nFlush \nVolume","Annual \nFlow \nVolume","Annual\nConsumption","Annual \nFlush \nVolume","Annual \nFlow \nVolume","Annual\nConsumption"]
[null,null,{"$f":"IF(OR(D17=\"Instructions\",D17=\"Base Calc\",D17=\"Lowrise Indoor Water Use\",D17=\"Lowrise Wastewater Use\",D17=\"Summary D+C\",D17=\"Summary O+M\",D17=\"Summary ND\",D17=\"\",D17=0),0,1)","v":1},{"$f":"IFERROR(INDEX(MID(Sheets,FIND(\"]\",Sheets)+1,255),ROW(A2),1),\"\")","v":"Group 1"},{"$f":"INDIRECT(\"'\"&D17&\"'!$Z$12\")","v":0},{"$f":"INDIRECT(\"'\"&$D17&\"'!$Z$11\")","v":0},{"$f":"E17+F17","v":0},{"$f":"INDIRECT(\"'\"&$D17&\"'!$Z$14\")","v":0},{"$f":"INDIRECT(\"'\"&$D17&\"'!$Z$13\")","v":0},{"$f":"H17+I17","v":0}]
[null,null,1]
[null,"A",1,{"$f":"IF(Instructions!T57=1,\"Annual baseline water consumption (gallons/year)\",\"Annual baseline water consumption (liters/year)\")","v":"Annual baseline water consumption (gallons/year)"},null,null,null,null,null,{"$f":"SUM(G17:G18)","v":0}]
[null,null,1,{"$f":"IF(Instructions!T57=1,\"Annual design water consumption (gallons/year)\",\"Annual design water consumption (liters/year)\")","v":"Annual design water consumption (gallons/year)"},null,null,null,null,null,{"$f":"SUM(J17:J18)","v":0}]
{"$rows_left_out":9}
{"sheet":"Summary ND","index":7,"n_rows":45,"n_cols":10,"rows_kept":45,"cut":false,"hidden":true,"merged":[[42,3,43,8],[12,3,14,3],[12,4,12,6],[12,7,12,9],[13,4,13,6],[13,7,13,9]]}
[]
[null,null,1]
[null,null,1,"Summary for Neighborhood Development Rating Systems"]
[null,null,1,"Note: All information on this tab is READ-ONLY. To edit, see the previous tab(s). "]
[null,null,1]
[null,null,1]
[null,null,1,"GIB Prerequisite/Credit Indoor Water Use Reduction"]
[null,null,1]
[null,null,1,"Nonresidential buildings, mixed-use buildings, and multifamily residential buildings four stories or more"]
[null,null,1]
[null,null,1]
[null,null,1]
[null,null,1,"Group Name","Baseline Case",null,null,"Design Case"]
[null,null,null,null,{"$f":"IF(Instructions!T57=1,\"(gallons/year)\",\"(liters/year)\")","v":"(gallons/year)"},null,null,{"$f":"IF(Instructions!T57=1,\"(gallons/year)\",\"(liters/year)\")","v":"(gallons/year)"}]
[null,null,1,null,"Annual \nFlush \nVolume","Annual \nFlow \nVolume","Annual\nConsumption","Annual \nFlush \nVolume","Annual \nFlow \nVolume","Annual \nConsumption"]
[null,null,{"$f":"IF(OR(D16=\"Instructions\",D16=\"Base Calc\",D16=\"Lowrise Indoor Water Use\",D16=\"Lowrise Wastewater Use\",D16=\"Summary D+C\",D16=\"Summary O+M\",D16=\"Summary ND\",D16=\"\",D16=0),0,1)","v":1},{"$f":"IFERROR(INDEX(MID(Sheets,FIND(\"]\",Sheets)+1,255),ROW(A2),1),\"\")","v":"Group 1"},{"$f":"INDIRECT(\"'\"&D16&\"'!$Z$12\")","v":0},{"$f":"INDIRECT(\"'\"&$D16&\"'!$Z$11\")","v":0},{"$f":"E16+F16","v":0},{"$f":"INDIRECT(\"'\"&$D16&\"'!$Z$14\")","v":0},{"$f":"INDIRECT(\"'\"&$D16&\"'!$Z$13\")","v":0},{"$f":"H16+I16","v":0}]
[null,null,1]
[null,"A",1,{"$f":"IF(Instructions!T57=1,\"Annual baseline water consumption (gallons/year)\",\"Annual baseline water consumption (liters/year)\")","v":"Annual baseline water consumption (gallons/year)"},null,null,null,null,null,{"$f":"SUM(G16:G17)","v":0}]
[null,null,1,{"$f":"IF(Instructions!T57=1,\"Annual design water consumption (gallons/year)\",\"Annual design water consumption (liters/year)\")","v":"Annual design water consumption (gallons/year)"},null,null,null,null,null,{"$f":"SUM(J16:J17)","v":0}]
[null,null,1,"Percent water use reduction for nonresidential and midrise buildings (%)",null,null,null,null,null,{"$f":"IF(J19=0,0,(J18-J19)/J18)","v":0}]
{"$rows_left_out":25}